{"text_format":"1","workbook":"xlsx","n_sheets":6,"sheets":["START","1. Impacts Questionnaire","2. Carbon Assessment","3. Equalities Assessment","4. Results","Refs"],"not_rendered":{"charts":0,"images":6,"macros":1,"external_links":0,"defined_names":8,"comments":4,"pivot_tables":0},"unopened":[],"bounds":{"document_bytes":16777216,"sheet_cells":100000,"rows_first":2000,"rows_last":500,"rows_between":2000,"halvings":0,"cell_chars":16384,"cell_head_chars":4096},"cells_cut":0,"cells_raw":0,"read":"whole","date_system":"1900"}

{"sheet":"START","index":0,"n_rows":27,"n_cols":4,"rows_kept":27,"cut":false,"hidden":false,"merged":[[2,2,3,4],[5,2,5,5],[22,2,22,3]]}
[]
[null,null,"Decision Support Tool"]
[null,null,"Introduction"]
[]
[]
[null,null,"This Decision Support Tool allows users to self-assess the impact of the proposed policies, initiatives, or services against GMCA policy frameworks. It provides decision makers with a high-level assessment of how a Decision meets GMCA policy goals and can facilitate a process of revising Decisions to more fully meet these goals. Where more detailed assessment is needed, users should consult other tools that lead to a full assessment of specific impact areas as indicated (e.g. Environmental Impact Assessment, Cost Benefit Analysis (CBA)). Users self-assess against nine impact areas (Equalities, Health, Resilience & Adaptation, Housing, Economy, Mobility & Connectivity, Carbon, Nature & Environment, Consumption and Production and the 2038 Carbon Neutral target). Depending on your answers, you may then be directed into a self-reported Carbon Assessment tab, where your paper will be compared to relevant best practice. If your paper impacts on people with ‘protected characteristics’, you will be directed to the Equalities Impact Assessment tab. \n\nNote that the Carbon Assessment does not yet assess embodied carbon and the tool does not go into the detail of intersectionality with regard to equality and inclusion impacts. As such, it is important that users take an overview approach when using this tool to inform decision-making at CA level."]
[]
[null,null,"Overview information","Please complete all fields"]
[null,null,"Name of policy / initiative / service to be assessed"]
[null,null,"Author(s)"]
[null,null,"Date of Assessment"]
[null,null,"Document Version"]
[null,null,"Corporate objective being addressed"]
[null,null,"Department / function carrying out the assessment "]
[null,null,"Who is responsible for the implementation of the policy / initiative / service? (function head / department manager)"]
[null,null,"Brief description of the proposal or decision"]
[null,null,"Value (£)"]
[null,null,"Is this a strategy document?"]
[null,null,"If this is a strategy document will this strategy have an impact over multiple years?"]
[null,null,"Where does this policy / initiative / service apply to? (Check all that apply)"]
{"$rows_left_out":8}
{"sheet":"1. Impacts Questionnaire","index":1,"n_rows":160,"n_cols":26,"rows_kept":160,"cut":false,"hidden":false,"merged":[[6,2,6,15],[7,2,7,15],[9,2,9,15],[8,2,8,15],[27,21,31,21],[111,13,111,14],[122,13,122,14],[127,9,127,21],[127,7,127,8],[76,13,76,14],[78,13,78,14],[104,13,104,14],[105,13,105,14],[108,13,108,14],[87,5,87,11],[93,5,93,11],[96,5,96,11],[97,5,97,11],[88,5,88,11],[94,5,94,11],[95,5,95,11],[92,5,92,11],[110,13,110,14],[106,5,106,11],[38,21,43,21],[50,21,54,21],[61,21,66,21],[73,21,80,21],[106,13,106,14],[107,5,107,11],[107,13,107,14],[121,13,121,14],[43,13,43,14],[50,13,50,14],[54,13,54,14],[61,13,61,14],[75,13,75,14],[119,15,119,17],[120,15,120,17],[87,21,97,21],[119,21,123,21],[104,21,112,21],[121,15,121,17],[122,15,122,17],[123,15,123,17],[39,13,39,14],[42,13,42,14],[87,13,87,14],[10,4,10,15],[11,4,11,15],[12,4,12,15],[57,2,59,7],[69,2,71,7],[61,2,66,2],[62,5,62,11],[63,5,63,11],[64,5,64,11],[65,5,65,11],[66,5,66,11],[13,4,13,15],[14,4,14,15],[27,13,27,14],[29,13,29,14],[31,13,31,14],[16,4,16,15],[17,4,17,15],[52,5,52,11],[53,5,53,11],[18,4,18,15],[19,4,19,15],[28,5,28,11],[27,5,27,11],[73,2,80,2],[74,5,74,11],[75,5,75,11],[76,5,76,11],[77,5,77,11],[78,5,78,11],[79,5,79,11],[80,5,80,11],[73,5,73,11],[31,5,31,11],[30,5,30,11],[46,2,48,7],[38,2,43,2],[50,2,54,2],[54,5,54,11],[38,5,38,11],[39,5,39,11],[40,5,40,11],[159,4,159,8],[127,2,127,6],[109,5,109,11],[110,5,110,11],[115,2,117,7],[100,2,102,7],[112,5,112,11],[120,5,120,11],[121,5,121,11],[122,5,122,11],[123,5,123,11],[104,5,104,11],[105,5,105,11],[108,5,108,11],[132,2,140,2],[131,2,131,16],[4,2,4,15],[5,2,5,15],[157,4,157,8],[28,3,29,3],[148,4,148,6],[89,5,89,11],[90,5,90,11],[91,5,91,11],[119,2,123,2],[87,2,97,2],[111,5,111,11],[104,2,111,2],[119,5,119,11],[29,5,29,11],[41,5,41,11],[42,5,42,11],[43,5,43,11],[50,5,50,11],[51,5,51,11],[61,5,61,11],[83,2,85,7],[34,2,36,7],[27,2,31,2],[23,2,25,7]]}
[]
[null,null,"1. Impacts Questionnaire"]
[]
[null,null,"Guide"]
[null,null,"This questionnaire will provide high level scoring on key impact areas related to GMCA policy. The results are given a RAG (Red, Amber, Green) result indicating how the proposed Decision fits with GMCA policy related to the impact area."]
[null,null,"Definitions\nSome questions have a 'red corner' in the cell; this indicates that there are guidance notes available to view in relation to that question. To view these, hover the mouse pointer over one of these cells (you can practice by hovering over this cell). In the cells next to the question there are also links to websites with further supporting information."]
[null,null,"Impact areas\nQuestions for each impact area require a yes/no answer to determine if they are relevant. These are set to YES as default – once you have read through the questions in that impact area, you may select NO if this area is not relevant to your paper.  "]
[null,null,"Different types of papers and confidence in your assessment\nIt is understood that various types of Decisions are being assessed through this tool. For some papers, for example new strategies, you may not feel able to answer all of the questions with confidence as this will depend on delivery. You should answer on the basis of what the strategy aims to achieve – however, this is an important opportunity to consider where issues at the delivery stage could undermine your aims. You should note these challenges and specify any mitigation measures needed to ensure delivery is in line with the original aspirations on the results page."]
[null,null,"Some papers may have a number of projects within them and so the answers between projects could be different. Here we ask you to take a high level (‘helicopter’) view, assessing across the content of the paper. However, again, where there are particular areas that will have negative impacts or there are risks that the assessed level of positive impact will not be met – specific mitigation measures should be flagged by users on the results page."]
[null,null,"Impact categories\nThe definitions of the possible impacts are as follows:"]
[null,null,null,null,"Yes, with long lasting and/or significant positive impact.  The proposal or decision has positive impacts that are long lasting (3 or more years) and/or are significant for large numbers of GM residents and/or a significant proportion of a particular group or community."]
[null,null,null,null,"Yes, with short term (3 years or less) or limited positive impact. The proposal or decision has positive impact, but will be limited in its effects or have a short lifespan."]
[null,null,null,null,"No, the decision or proposal has no discernable positive or negative impact. It will not affect any discernible positive or negative change. "]
[null,null,null,null,"Yes, but with short term (3 years or less) or limited negative impact. The proposal or decision has negative short term or limited impacts."]
[null,null,null,null,"Yes, but with long lasting (more than 3 years) or severe negative impact. The proposal or decision has negative impacts that are long lasting (3 or more years) and/or are significant for large numbers of GM residents and/or a significant proportion of a particular group or community."]
[null,null,"All Decisions will then be given a RAG (Red, Amber, Green) rating on applicable Impact areas. The definitions of these are:"]
[null,null,null,null,"All green. The proposal or decision is expected to have positive impacts overall, whether long or short term."]
[null,null,null,null,"Equal number of red and green OR at least one red. The proposal or decision has both positive and negative impacts OR have net neutral impact with equal positive and negative overall outcomes. Careful consideration of trade-offs is recommended."]
[null,null,null,null,"Mostly red, with at least one green. Careful consideration of trade-offs is necessary."]
[null,null,null,null,"All red. The proposal or decision is expected result to negative impacts overall. It should receive most attention for mitigation or be avoided. Clear and evidenced justification to progress this proposal will be required."]
{"$rows_left_out":141}
{"sheet":"2. Carbon Assessment","index":2,"n_rows":130,"n_cols":25,"rows_kept":130,"cut":false,"hidden":false,"merged":[[113,3,117,3],[112,5,112,6],[116,5,116,6],[121,5,121,6],[43,5,43,6],[59,5,59,6],[104,5,104,6],[106,5,106,6],[23,7,23,8],[28,7,28,8],[52,7,52,8],[39,2,39,3],[40,2,40,3],[48,2,48,3],[49,2,49,3],[50,2,50,3],[107,2,107,3],[80,2,80,3],[81,2,81,3],[82,2,82,3],[87,2,87,3],[88,2,88,3],[89,2,89,3],[69,2,69,3],[9,2,9,7],[30,2,30,3],[31,2,31,3],[37,2,37,3],[26,5,26,6],[31,5,31,6],[24,2,24,3],[25,2,25,3],[26,2,26,3],[27,2,27,3],[28,2,28,3],[29,2,29,3],[77,16,82,17],[78,9,78,15],[23,16,31,17],[37,16,43,17],[48,9,48,15],[94,7,94,8],[89,9,89,15],[94,9,94,15],[94,2,94,3],[87,9,87,15],[88,9,88,15],[87,16,89,17],[58,9,58,15],[59,9,59,15],[55,9,55,15],[56,9,56,15],[57,9,57,15],[41,9,41,15],[42,7,42,8],[42,9,42,15],[43,9,43,15],[48,7,48,8],[37,7,37,8],[37,9,37,15],[104,9,104,15],[104,16,107,17],[105,9,105,15],[106,9,106,15],[107,9,107,15],[97,7,97,8],[95,9,95,15],[96,9,96,15],[97,9,97,15],[94,16,97,17],[79,9,79,15],[80,9,80,15],[81,9,81,15],[82,9,82,15],[49,9,49,15],[50,9,50,15],[51,9,51,15],[52,9,52,15],[53,9,53,15],[54,9,54,15],[66,9,66,15],[67,9,67,15],[68,9,68,15],[69,9,69,15],[71,9,71,15],[72,9,72,15],[77,9,77,15],[70,9,70,15],[4,2,4,6],[5,2,5,6],[8,2,8,6],[38,2,38,3],[41,2,41,3],[42,2,42,3],[43,2,43,3],[48,16,59,17],[66,16,72,17],[38,9,38,15],[39,9,39,15],[40,9,40,15],[29,9,29,15],[30,9,30,15],[31,9,31,15],[23,9,23,15],[24,9,24,15],[25,9,25,15],[26,9,26,15],[27,9,27,15],[28,9,28,15],[6,2,6,3],[7,2,7,7],[23,2,23,3],[96,2,96,3],[97,2,97,3],[104,2,104,3],[105,2,105,3],[106,2,106,3],[57,2,57,3],[58,2,58,3],[59,2,59,3],[51,2,51,3],[66,2,66,3],[67,2,67,3],[68,2,68,3],[52,2,52,3],[53,2,53,3],[54,2,54,3],[55,2,55,3],[56,2,56,3],[71,2,71,3],[72,2,72,3],[77,2,77,3],[78,2,78,3],[79,2,79,3],[95,2,95,3],[70,2,70,3]]}
[]
[null,null,"2. Simple Carbon Assessment"]
[]
[null,null,"Guide"]
[null,null,"The Simple Carbon Assessment tool scores the Decision against best practice for reducing carbon emissions that cause climate change in line with GMCA targets. You only need to answer the sections indicated - this is determined by answers given in the Impacts Questionnaire."]
[null,null,"Some questions require a yes/no response that is scored. Others require a comment that will provide additional context for a reviewer of the decision. If 'Non Applicable\" is given as an answer add a brief explanation why this is the case."]
[null,null,"All questions need to be answered to score a section. "]
[null,null,"For any scoring a comment can be added as justification in the 'Comment' column."]
[null,null,"Embodied carbon is not specified in the simple assessment - full life cycle assessment is required and advisable to comment on this."]
[null,null,"The scoring is colour coded as follows:"]
[null,null,null,"Grey: No associated carbon impacts expected for decision."]
[null,null,null,"Green: In the simple assessment the decision meets the highest standard in terms of practice and awareness."]
[null,null,null,"Blue: In the simple assessment the decision meets most of the associated best practice with a good level of awareness."]
[null,null,null,"Brown: In the simple assessment the decision only partially meets associated best practice and/or awareness is lacking, significant room for improvement."]
[null,null,null,"Black: In the simple assessment the decision does not meet best practice and/or there is insufficient awareness of carbon impacts."]
[]
[null,null,"Simple Carbon Assessment"]
[]
[null,null,"Buildings"]
[]
{"$rows_left_out":111}
{"sheet":"3. Equalities Assessment","index":3,"n_rows":70,"n_cols":4,"rows_kept":70,"cut":false,"hidden":false,"merged":[[7,2,7,3],[16,2,16,3],[12,2,12,3],[14,2,14,3],[13,2,13,3],[15,2,15,3]]}
[null,null,{"$f":"IF(AND(D11<>\"If alternative EIA state here\",D11<>\"\"),1,IF(OR(D24<>\"\",D25<>\"\",D26<>\"\",D27<>\"\",D28<>\"\"),2,3))","v":3}]
[null,null,"3. Equalities Impact Assessment"]
[]
[null,{"$f":"IF(ISNUMBER(SEARCH(\"you are not required\",C4)),1,IF(ISNUMBER(SEARCH(\"you are required to complete this Equalities\",C4)),2,\"\"))","v":""},{"$f":"IF(AND('1. Impacts Questionnaire'!B27=1,OR('1. Impacts Questionnaire'!Z28=1,'1. Impacts Questionnaire'!Z28=2,'1. Impacts Questionnaire'!Z28=4,'1. Impacts Questionnaire'!Z28=5)),\"✅ Based on your Impacts Questionnaire response, you are required to complete this Equalities Impact Assessment.\",IF(OR('1. Impacts Questionnaire'!B27=2,'1. Impacts Questionnaire'!Z28=3),\"❌ Based on your Impacts Questionnaire response, you are not required to complete this Equalities Impact Assessment.\",\"Please complete Q1 of the Impacts Questionnaire to determine whether you are required to complete this section.\"))","v":"Please complete Q1 of the Impacts Questionnaire to determine whether you are required to complete this section."}]
[]
[null,null,"Guide"]
[null,null,"This form based on the GMFRS Equalities Impact Assessment."]
[null,null,"Some fields have already been answered based on the responses you provided on the Introductory sheet (marked here with an asterisk). If any of these are incorrect, please edit them on the Introductory form."]
[null,null,"This section is not scored."]
[null,null,null,"Answer:"]
[null,null,"If you have completed an Equalities Impact Assessment for this proposal in another form there is no need to complete this form, but please give details of the EIA completed that will be attached with the proposal:","If alternative EIA state here"]
[]
[null,null,"In accordance with s149(1) of the Equality Act 2010, Greater Manchester Combined Authority (GMCA) and Transport for Greater Manchester (TfGM) are required in the exercise of their functions to have due regard for the need to: \n"]
[null,null,"•   Eliminate unlawful discrimination, harassment and victimisation. \n•   Advance equality of opportunity between persons who share a relevant protected characteristic, and persons who do not share it. \n•   Foster good relations between those who have a relevant protected characteristic and those who don’t. "]
[null,null,"Having due regard to the need to advance equality of opportunity between persons who share a relevant protected characteristic and persons who do not share it involves having due regard, in particular, to the need to: "]
[null,null,"•   Remove or minimise disadvantages suffered by persons who share a relevant protected characteristic that are connected to that characteristic; \n•   Take steps to meet the needs of persons who share a relevant protected characteristic that are different from the needs of the persons who do not share it; \n•   Encourage persons who share a relevant protected characteristic to participate in public life or in any other activity in which participation by such persons is disproportionately low. "]
[null,null,"Having due regard to the need to foster good relations between persons who share a relevant protected characteristic and persons who do not share it involves having due regard, in particular, to the need to tackle prejudice and promote understanding. \n \n“Relevant protected characteristics” are age; disability; gender reassignment; pregnancy and maternity; race; religion or belief; sex; and sexual orientation. \n\nAs part of its compliance with this ongoing duty, TfGM undertakes an Equality Impact Assessment (EqIA) for any significant strategy, project, policy, process or procedure using a standard screening form designed to identify any adverse impacts on members of the above “protected characteristic groups” and to record actions planned to ameliorate any adverse impacts, should any be identified.   "]
[]
[null,null,"Section 1"]
[null,null,"Name of policy / initiative / Service to be impact assessed*",{"$f":"IF(START!D9<>\"\",START!D9,\"\")","v":""}]
{"$rows_left_out":51}
{"sheet":"4. Results","index":4,"n_rows":79,"n_cols":16,"rows_kept":79,"cut":false,"hidden":false,"merged":[[71,2,71,4],[77,2,77,4],[4,2,4,4],[5,2,5,4],[6,2,6,4],[7,2,7,4],[8,2,8,4],[53,2,53,4],[68,2,68,4],[69,2,69,4],[33,2,33,3],[70,2,70,4],[61,2,62,4],[64,2,65,4],[57,2,57,4],[20,2,20,4]]}
[]
[null,null,"4. Results"]
[]
[null,null,"Results, interpretation and use"]
[null,null,"This tool allows users to self-assess the impact of decisions against GMCA policy frameworks. Decisions may not always lead to universally positive outcomes. Here, the term ‘impact’ is used to capture both positive and negative outcomes of a decision."]
[null,null,"Impacts Questionnaire Result\nThe results give a RAG (red, amber, green) rating indicating whether expected impacts align with GMCA policy goals. An explanatory note/justification should be added to the overall rating result for each relevant impact area. For ease, the Justification/Mitigation column in the results tables contain all the comments that were provided whilst completing the questionnaires. These comments should be edited to provide useful information for decision-makers. They will be public and should be in plain English with references made to the full Decision Report. Please try to keep each comment box to under 100 words if possible."]
[null,null,"Carbon Assessment Result\nThe Carbon Assessment results indicate the degree to which best practice is being adopted for minimising carbon emissions with an associated colour rating (green, blue, brown and black). Again, comments pulled through from the questionnaire should be edited to ensure the information is useful for decision-makers."]
[null,null,"Recommendation Box\nIn this box, you should enter the recommendation that will be included in the paper. This recommendation should offer a very brief summary of the results of Decision Support Tool and must refer to any important caveats, mitigation measures, and negative impacts that decision-makers should note. For example noting whether postive/negative impacts are conditional on other policies or measures. \n \nThe text you provide in the Recommendation Box should also be copied into the Recommendations section of the paper submitted for decision itself where it says “The GMCA is requested to”. We therefore suggest you start your comments with words that call action such as, e.g., “agree”, “note”, “approve”."]
[null,null,"Exporting the result to your paper\nAn export button is provided below the results tables which will export these to a Word document. In addition, you should include the text you have added to the Recommendation Box in the relevant section within the main body of your paper. "]
[]
[null,null,"Progress checklist"]
[null,null,"Please refer to the following checklist to ensure all sections have been completed before proceeding to the results tables:"]
[]
[null,null,"START",null,{"$f":"IF(AND(START!D9<>\"\",START!D10<>\"\",START!D11<>\"\",START!D16<>\"\"),\"✅ The overview information on the START page has been completed.\",\"❌ The overview information on the START page has not been fully completed.\")","v":"❌ The overview information on the START page has not been fully completed."}]
[null,null,"1. Impacts Questionnaire",null,{"$f":"IF('1. Impacts Questionnaire'!B132=2,\"❌ The Impacts Questionnaire has not been fully completed.\",\"✅ The Impacts Questionnaire has been completed.\")","v":"❌ The Impacts Questionnaire has not been fully completed."}]
[null,null,"2. Carbon Assessment",null,{"$f":"IF('2. Carbon Assessment'!C113=1,\"✅ Based on your responses you are not required to complete the Carbon Assessment.\",IF(AND('2. Carbon Assessment'!C113=2,'2. Carbon Assessment'!C114=2),\"❌ The Carbon Assessment has not been fully completed.\",IF('2. Carbon Assessment'!C113=3,\"❌ Please complete the Impacts Questionnaire to determine which sections of the Carbon Assessment you are required to complete.\",\"✅ The Carbon Assessment has been completed.\")))","v":"❌ Please complete the Impacts Questionnaire to determine which sections of the Carbon Assessment you are required to complete."}]
[null,null,"3. Equalities Assessment",null,{"$f":"IF('3. Equalities Assessment'!B4=1,\"✅ Based on your responses you are not required to complete the Equalities Assessment.\",IF(AND('3. Equalities Assessment'!B4=2,'3. Equalities Assessment'!C1=3),\"❌ Please ensure you have completed the Equalities Assessment form.\",IF(AND('1. Impacts Questionnaire'!B27=1,'1. Impacts Questionnaire'!Z28=6),\"❌ Please complete the Impacts Questionnaire to determine if you are required to fill out the Equalities Assessment.\",\"✅ You have filled in the Equalities Assessment\")))","v":"❌ Please complete the Impacts Questionnaire to determine if you are required to fill out the Equalities Assessment."}]
[]
[]
[null,null,"Recommendation - Key points for decision-makers",null,null,"Word Count"]
{"$rows_left_out":60}
{"sheet":"Refs","index":5,"n_rows":13,"n_cols":28,"rows_kept":13,"cut":false,"hidden":true,"merged":[]}
[]
["Long term or significant positive",null,"Yes",null,"Don't know",null,"Don't know"]
["Short term or limited positive",null,"No",null,"Yes",null,"Yes"]
["No discernible impact",null,null,null,"No",null,"No"]
["Short term or limited negative",null,null,null,"Not Applicable"]
["Long lasting or significant negative"]
[]
[]
[]
[]
[null,null,null,null,null,null,null,null,null,null,null,null,null,null,null,null,null,null,null,"No associated carbon impacts expected.",null,"High standard in terms of practice and awareness on carbon.",null,"Mostly best practice with a good level of awareness on carbon.",null,"Partially meets best practice/ awareness, significant room to improve.",null,"Does not meet best practice and/ or insufficient awareness of carbon impacts."]
[]
[null,null,null,null,null,null,null,"G","Positive impacts overall, whether long or short term.","A","Mix of positive and negative impacts. Trade-offs to consider.","R","Mostly negative, with at least one positive aspect. Trade-offs to consider.","RR","Negative impacts overall. "]